First step towards a deploy stage

Version 0.26 (ci.1). Tagged as 'builder-0_26-ci_1'

Version 0.27. Tagged as 'builder-0_27'
11 jobs for master in 21 minutes and 52 seconds (queued for 47 seconds)
Status Job ID Name Coverage
  Static Analysis
failed #1347
cross allowed to fail
cppcheck

00:00:01

passed #1341
cross
gitattributes

00:00:02

passed #1342
cross
license

00:00:02

passed #1344
cross
log

00:00:02

passed #1345
cross
makefile

00:00:01

passed #1343
cross
versionnum

00:00:02

failed #1346
cross allowed to fail
whitespace

00:00:02

 
  Softload
passed #1348
cross
softload

00:04:23

failed #1349
cross allowed to fail
softload_gnu

00:04:48

 
  Disc
failed #1350
cross allowed to fail
disc_BuildHost

00:06:28

 
  Deploy
passed #1351
cross
deploy

00:05:56

 
Name Stage Failure
failed
disc_BuildHost Disc
Error running make export (hdrs) on module 'chmod'.
Error running make export (hdrs) on module 'egrep'.
Error running make export (hdrs) on module 'grep'.
Error running make export (hdrs) on module 'mkdir'.
Error running make export (hdrs) on module 'sed'.
Error running make export (hdrs) on module 'wc'.
Error running make export (hdrs) on module 'ShrinkWrap'.
------------------------------------------------------------------------------
ERROR: Job failed: exit status 1
failed
softload_gnu Softload
arm-unknown-riscos-gcc -mlibscl -o !RunImage,ff8 main.o msg.o env.o file.o parse.o build.o /var/lib/gitlab-runner/builds/SP-6AeWF/0/bavison/builder/RiscOS/Export/APCS-32/Lib/tboxlibs/eventlib.a /var/lib/gitlab-runner/builds/SP-6AeWF/0/bavison/builder/RiscOS/Export/APCS-32/Lib/tboxlibs/toolboxlib.a /var/lib/gitlab-runner/builds/SP-6AeWF/0/bavison/builder/RiscOS/Export/APCS-32/Lib/tboxlibs/renderlib.a /var/lib/gitlab-runner/builds/SP-6AeWF/0/bavison/builder/RiscOS/Export/APCS-32/Lib/tboxlibs/wimplib.a 
/var/lib/gitlab-runner/builds/SP-6AeWF/0/bavison/builder/RiscOS/Export/APCS-32/Lib/tboxlibs/eventlib.a: file not recognized: File format not recognized
collect2: error: ld returned 1 exit status
CApp:191: recipe for target '!RunImage,ff8' failed
make[1]: *** [!RunImage,ff8] Error 1
make[1]: Target 'install' not remade because of errors.
CApp:111: recipe for target 'install' failed
make: *** [install] Error 2
ERROR: Job failed: exit status 1
failed
cppcheck Static Analysis
        }
}
}
When you see this message it is always safe to reduce the variable scope 1 level.
6/6 files checked 100% done
[c/parse:103]: (style) The function 'extract_word' is never used.
[c/parse:76]: (style) The function 'read_env' is never used.
(information) Cppcheck cannot find all the include files. Cppcheck can check the code without the include files found. But the results will probably be more accurate if all the include files are found. Please check your project's include directories and add all of them as include directories for Cppcheck. To see what files Cppcheck cannot find use --check-config.
ERROR: Job failed: exit status 1
failed
whitespace Static Analysis
c/main:698:        	BUILD_GADGET_TREE));
c/main:715: IdBlock *id_block, void *handle)
c/main:744: IdBlock *id_block, void *handle)
c/main:764: IdBlock *id_block, void *handle)
c/main:795: COMPONENTS_DIR,build_name);
c/main:876: key_pressed,NULL));
h/resources:75: "export_hdrs", 0x0A, 0,
VersionNum:7:#define Module_MinorVersion_CMHG
ERROR: Job failed: exit status 1