Test debug-builds CI

18 jobs for debug-builds in 2 minutes and 56 seconds (queued for 4 seconds)
Status Job ID Name Coverage
  Static Analysis
failed #41179
cross allowed to fail
cppcheck

00:00:23

passed #41172
cross
gitattributes

00:00:00

passed #41173
cross
gitignore

00:00:00

passed #41176
cross
head_log

00:00:00

passed #41178
cross
head_whitesp

00:00:00

passed #41174
cross
license

00:00:00

passed #41177
cross
makefile

00:00:00

passed #41175
cross
versionnum

00:00:00

 
  Softload
failed #41182
cross allowed to fail
debug

00:00:04

failed #41180
cross allowed to fail
softload

00:00:05

failed #41181
cross allowed to fail
softload_gnu

00:00:04

 
  Rom
failed #41183
cross allowed to fail
rom_BCM2835

00:00:23

failed #41188
cross allowed to fail
rom_iMx6

00:00:22

failed #41184
cross allowed to fail
rom_OMAP3

00:00:20

failed #41185
cross allowed to fail
rom_OMAP4

00:00:21

failed #41186
cross allowed to fail
rom_OMAP5

00:00:21

failed #41187
cross allowed to fail
rom_Titanium

00:00:21

 
  Cleanup
passed #41189
cross
cleanup

00:00:01

 
Name Stage Failure
failed
rom_iMx6 Rom
Error running make export (hdrs) on module 'HAL_iMx6'.
Error running make export (hdrs) on module 'FileCore'.
Error running make export (hdrs) on module 'ADFS'.
Error running make export (hdrs) on module 'RamFS'.
Error running make export (hdrs) on module 'SCSIFS'.
Error running make export (hdrs) on module 'SDFS'.
------------------------------------------------------------------------------
Cleaning up project directory and file based variables
ERROR: Job failed: exit status 1

failed
rom_Titanium Rom
Batched errors...
Error running make export (hdrs) on module 'FileCore'.
Error running make export (hdrs) on module 'ADFS4'.
Error running make export (hdrs) on module 'RamFS'.
Error running make export (hdrs) on module 'SCSIFS'.
Error running make export (hdrs) on module 'SDFS'.
------------------------------------------------------------------------------
Cleaning up project directory and file based variables
ERROR: Job failed: exit status 1

failed
rom_OMAP5 Rom
Batched errors...
Error running make export (hdrs) on module 'FileCore'.
Error running make export (hdrs) on module 'ADFS4'.
Error running make export (hdrs) on module 'RamFS'.
Error running make export (hdrs) on module 'SCSIFS'.
Error running make export (hdrs) on module 'SDFS'.
------------------------------------------------------------------------------
Cleaning up project directory and file based variables
ERROR: Job failed: exit status 1

failed
rom_OMAP4 Rom
Error running make export (hdrs) on module 'HAL_OMAP4'.
Error running make export (hdrs) on module 'FileCore'.
Error running make export (hdrs) on module 'ADFS'.
Error running make export (hdrs) on module 'RamFS'.
Error running make export (hdrs) on module 'SCSIFS'.
Error running make export (hdrs) on module 'SDFS'.
------------------------------------------------------------------------------
Cleaning up project directory and file based variables
ERROR: Job failed: exit status 1

failed
rom_OMAP3 Rom
Batched errors...
Error running make export (hdrs) on module 'FileCore'.
Error running make export (hdrs) on module 'ADFS'.
Error running make export (hdrs) on module 'RamFS'.
Error running make export (hdrs) on module 'SCSIFS'.
Error running make export (hdrs) on module 'SDFS'.
------------------------------------------------------------------------------
Cleaning up project directory and file based variables
ERROR: Job failed: exit status 1

failed
rom_BCM2835 Rom
Error running make export (hdrs) on module 'HAL_BCM2835'.
Error running make export (hdrs) on module 'FileCore'.
Error running make export (hdrs) on module 'ADFS'.
Error running make export (hdrs) on module 'RamFS'.
Error running make export (hdrs) on module 'SCSIFS'.
Error running make export (hdrs) on module 'SDFS'.
------------------------------------------------------------------------------
Cleaning up project directory and file based variables
ERROR: Job failed: exit status 1

failed
debug Softload
rm -rf _ResData_/tmp
mv _ResData_/SDIODriver/MergedMessages _ResData_/SDIODriver/Messages
perl /home/gitlab-runner/builds/hYz1sbzj/0/bavison/SDIODriver/RiscOS/Library/Build/InstViaRG,102 _ResData_ Resources _ResGen_
resgen Resources SDIODriverMsgs.o -via _ResGen_
cp -afL SDIODriverMsgs.o SDIODriverMsgs.od
make[1]: Target 'debug' not remade because of errors.
make: *** [CModule:239: debug] Error 2
Cleaning up project directory and file based variables
ERROR: Job failed: exit status 1

failed
softload_gnu Softload
cat _ResData_/tmp/Messages _ResData_/tmp/CmdHelp > _ResData_/SDIODriver/MergedMessages
rm -rf _ResData_/tmp
mv _ResData_/SDIODriver/MergedMessages _ResData_/SDIODriver/Messages
perl /home/gitlab-runner/builds/hYz1sbzj/0/bavison/SDIODriver/RiscOS/Library/Build/InstViaRG,102 _ResData_ Resources _ResGen_
resgen Resources SDIODriverMsgs.o -via _ResGen_
make[1]: Target 'install' not remade because of errors.
make: *** [CModule:239: install] Error 2
Cleaning up project directory and file based variables
ERROR: Job failed: exit status 1

failed
softload Softload
cat _ResData_/tmp/Messages _ResData_/tmp/CmdHelp > _ResData_/SDIODriver/MergedMessages
rm -rf _ResData_/tmp
mv _ResData_/SDIODriver/MergedMessages _ResData_/SDIODriver/Messages
perl /home/gitlab-runner/builds/hYz1sbzj/0/bavison/SDIODriver/RiscOS/Library/Build/InstViaRG,102 _ResData_ Resources _ResGen_
resgen Resources SDIODriverMsgs.o -via _ResGen_
make[1]: Target 'install' not remade because of errors.
make: *** [CModule:239: install] Error 2
Cleaning up project directory and file based variables
ERROR: Job failed: exit status 1

failed
cppcheck Static Analysis

^
objs/module.c:487:0: style: The function 'module_tickerv_handler' is never used. [unusedFunction]

^
nofile:0:0: information: Unmatched suppression: purgedConfiguration [unmatchedSuppression]

Cleaning up project directory and file based variables
ERROR: Job failed: exit status 1