Merge branch 'HAL'

* The target `TML_HostFS` continues to build the driver for the TML podule,
  as was the case previously on branch `master`.
* The target `TML_HostFS` from the `HAL` branch, which is a veneer to
  the `DADebug` module, can now be built by using the new target `DA_HostFS`.
* The target `HAL_HostFS` builds the variant that uses the HAL DebugTX API,
  as was the case previously on branch `HAL`.

Version 0.04. Tagged as 'HostFS-0_04'
20 jobs for HostFS-0_04 in 4 minutes and 25 seconds (queued for 2 minutes and 30 seconds)
latest
Status Job ID Name Coverage
  Static Analysis
passed #22653
cross
gitattributes

00:00:01

passed #22654
cross
gitignore

00:00:01

passed #22657
cross
head_log

00:00:01

passed #22659
cross
head_whitesp

00:00:01

passed #22655
cross
license

00:00:01

passed #22658
cross
makefile

00:00:01

passed #22656
cross
versionnum

00:00:01

 
  Softload
passed #22660
cross
softload

00:00:04

failed #22661
cross allowed to fail
softload_gnu

00:00:04

 
  Disc
failed #22662
cross allowed to fail
disc_BuildHost

00:00:15

failed #22663
cross allowed to fail
disc_Disc

00:00:27

 
  Rom
failed #22664
cross allowed to fail
rom_BCM2835

00:00:25

failed #22671
cross allowed to fail
rom_iMx6

00:00:25

failed #22665
cross allowed to fail
rom_IOMD32

00:00:24

failed #22666
cross allowed to fail
rom_OMAP3

00:00:25

failed #22667
cross allowed to fail
rom_OMAP4

00:00:26

failed #22668
cross allowed to fail
rom_OMAP5

00:00:25

failed #22669
cross allowed to fail
rom_Titanium

00:00:25

failed #22670
cross allowed to fail
rom_Tungsten

00:00:25

 
  Cleanup
passed #22672
cross
cleanup

00:00:01

 
Name Stage Failure
failed
rom_iMx6 Rom
Batched errors...
Error running make export (hdrs) on module 'FileCore'.
Error running make export (hdrs) on module 'ADFS'.
Error running make export (hdrs) on module 'RamFS'.
Error running make export (hdrs) on module 'SCSIFS'.
Error running make export (hdrs) on module 'SDFS'.
------------------------------------------------------------------------------
Cleaning up file based variables
ERROR: Job failed: exit status 1
failed
rom_Tungsten Rom
------------------------------------------------------------------------------
Batched errors...
Error running make export (hdrs) on module 'FileCore'.
Error running make export (hdrs) on module 'ADFS'.
Error running make export (hdrs) on module 'RamFS'.
Error running make export (hdrs) on module 'SCSIFS'.
------------------------------------------------------------------------------
Cleaning up file based variables
ERROR: Job failed: exit status 1
failed
rom_Titanium Rom
Batched errors...
Error running make export (hdrs) on module 'FileCore'.
Error running make export (hdrs) on module 'ADFS4'.
Error running make export (hdrs) on module 'RamFS'.
Error running make export (hdrs) on module 'SCSIFS'.
Error running make export (hdrs) on module 'SDFS'.
------------------------------------------------------------------------------
Cleaning up file based variables
ERROR: Job failed: exit status 1
failed
rom_OMAP5 Rom
Batched errors...
Error running make export (hdrs) on module 'FileCore'.
Error running make export (hdrs) on module 'ADFS4'.
Error running make export (hdrs) on module 'RamFS'.
Error running make export (hdrs) on module 'SCSIFS'.
Error running make export (hdrs) on module 'SDFS'.
------------------------------------------------------------------------------
Cleaning up file based variables
ERROR: Job failed: exit status 1
failed
rom_OMAP4 Rom
Batched errors...
Error running make export (hdrs) on module 'FileCore'.
Error running make export (hdrs) on module 'ADFS'.
Error running make export (hdrs) on module 'RamFS'.
Error running make export (hdrs) on module 'SCSIFS'.
Error running make export (hdrs) on module 'SDFS'.
------------------------------------------------------------------------------
Cleaning up file based variables
ERROR: Job failed: exit status 1
failed
rom_OMAP3 Rom
Batched errors...
Error running make export (hdrs) on module 'FileCore'.
Error running make export (hdrs) on module 'ADFS'.
Error running make export (hdrs) on module 'RamFS'.
Error running make export (hdrs) on module 'SCSIFS'.
Error running make export (hdrs) on module 'SDFS'.
------------------------------------------------------------------------------
Cleaning up file based variables
ERROR: Job failed: exit status 1
failed
rom_IOMD32 Rom
------------------------------------------------------------------------------
Batched errors...
Error running make export (hdrs) on module 'FileCore'.
Error running make export (hdrs) on module 'ADFS'.
Error running make export (hdrs) on module 'RamFS'.
Error running make export (hdrs) on module 'SCSIFS'.
------------------------------------------------------------------------------
Cleaning up file based variables
ERROR: Job failed: exit status 1
failed
rom_BCM2835 Rom
Batched errors...
Error running make export (hdrs) on module 'FileCore'.
Error running make export (hdrs) on module 'ADFS'.
Error running make export (hdrs) on module 'RamFS'.
Error running make export (hdrs) on module 'SCSIFS'.
Error running make export (hdrs) on module 'SDFS'.
------------------------------------------------------------------------------
Cleaning up file based variables
ERROR: Job failed: exit status 1
failed
disc_Disc Disc
Error running make export (hdrs) on module 'PDumperE2'.
Error running make export (hdrs) on module 'PDumperIW'.
Error running make export (hdrs) on module 'PDumperLJ'.
Error running make export (hdrs) on module 'DesktopBoot'.
Error running make export (hdrs) on module 'PatchesPatch'.
Error running make export (hdrs) on module 'ChangeFSI'.
------------------------------------------------------------------------------
Cleaning up file based variables
ERROR: Job failed: exit status 1
failed
disc_BuildHost Disc
Error running make export (hdrs) on module 'egrep'.
Error running make export (hdrs) on module 'grep'.
Error running make export (hdrs) on module 'mkdir'.
Error running make export (hdrs) on module 'sed'.
Error running make export (hdrs) on module 'wc'.
Error running make export (hdrs) on module 'ShrinkWrap'.
------------------------------------------------------------------------------
Cleaning up file based variables
ERROR: Job failed: exit status 1
failed
softload_gnu Softload
CModule:446: recipe for target 'HAL_HostFS,ffa' failed
make[2]: *** [HAL_HostFS,ffa] Error 1
make[2]: Target 'install' not remade because of errors.
CModule:235: recipe for target 'install' failed
make[1]: *** [install] Error 2
Makefile:31: recipe for target 'install' failed
make: *** [install] Error 2
Cleaning up file based variables
ERROR: Job failed: exit status 1